{"text_format":"1","workbook":"xlsx","n_sheets":8,"sheets":["Disclaimer","CORTEC","Configurator","Documents","Master Text","BOM","Database","Date Drivers"],"not_rendered":{"charts":0,"images":0,"macros":0,"external_links":0,"defined_names":3,"comments":0,"pivot_tables":0},"unopened":[],"bounds":{"document_bytes":16777216,"sheet_cells":100000,"rows_first":2000,"rows_last":500,"rows_between":2000,"halvings":0,"cell_chars":16384,"cell_head_chars":4096},"cells_cut":0,"cells_raw":0,"read":"whole","date_system":"1900"}

{"sheet":"Disclaimer","index":0,"n_rows":6,"n_cols":2,"rows_kept":6,"cut":false,"hidden":false,"merged":[[2,1,2,9],[5,1,7,9],[3,1,4,9]]}
[]
[]
[null,"Our policy is one of continuous development. Accordingly the design of our products may change at any time. "]
[null,"Whilst every effort is made to produce up to date literature, this document should only be regarded as a guide and is intended for information purposes only."]
[]
[null,"Its contents do not constitute an offer for sale or advice on the application of any product referred to in it. We cannot be held responsible for any reliance on any decisions taken on its contents without specific advice."]

{"sheet":"CORTEC","index":1,"n_rows":52,"n_cols":16,"rows_kept":52,"cut":false,"hidden":false,"merged":[[2,1,2,2]]}
[null,"Ordering information"]
[]
[null,"Variants Order No.     ",null,null,null,"P847",null,null,null,null,null,null,null,"**"]
[null,"Model"]
[null,"Phasor Measurement Unit"]
[]
[null,"Nominal auxiliary voltage"]
[1,"24-54 Vdc",null,null,null,null,7]
[2,"48-125 Vdc (40-100 Vac)",null,null,null,null,8]
[3,"110-250 Vdc (100-240 Vac)",null,null,null,null,9]
[]
[null,"In/Vn rating "]
[1,"In = 1 A/5 A : Vn = 100 - 120 Vac, 4 CT & 3 VT (60TE)",null,null,null,null,null,1]
[null,"In = 1 A/5 A : Vn = 100 - 120 Vac, 12CT & 3VT (80TE)",null,null,null,null,null,2]
[]
[null,"Hardware options"]
["B","Ethernet (100Mbps) plus IRIG-B (Un-modulated)",null,null,null,null,null,null,"B"]
[null,"Redundant Ethernet Self-Healing Ring + Un-modulated IRIG-B",null,null,null,null,null,null,"H"]
[null,"Redundant Ethernet Rapid Spanning Tree Protocol + Un-modulated IRIG-B",null,null,null,null,null,null,"K"]
[null,"Redundant Ethernet Dual Homing Star + Un-modulated IRIG-B",null,null,null,null,null,null,"M"]
[]
[null,"Product Options"]
["A","8 Inputs & 8 Outputs + Backup Protection (60TE) 50/60 Hz",null,null,null,null,null,null,null,"A"]
[null,"16 Inputs & 8 Outputs (80TE) 50/60 Hz ",null,null,null,null,null,null,null,"B"]
[null,"24 Inputs & 24 Outputs (80TE) 50/60 Hz",null,null,null,null,null,null,null,"C"]
[]
[null,"Protocol options"]
[null,"K-Bus",null,null,null,null,null,null,null,null,1]
[6,"IEC61850 + Courier via rear RS485 port",null,null,null,null,null,null,null,null,6]
[null,"DNP3 over Ethernet with Courier rear port K-Bus/RS485 protocol",null,null,null,null,null,null,null,null,8]
{"$rows_left_out":23}
{"sheet":"Configurator","index":2,"n_rows":25,"n_cols":13,"rows_kept":25,"cut":false,"hidden":false,"merged":[[2,1,2,2],[1,1,1,2],[4,1,4,2],[6,1,6,2],[20,1,20,2],[24,1,24,2],[8,1,8,2],[10,1,10,2],[13,1,13,2],[15,1,15,2],[17,1,17,2],[19,1,19,2],[22,1,22,2]]}
[]
["Digit #","1 - 4",null,"5","6","7","8","9","10","11","12-13","14","15"]
["P847 Phasor Measurement Unit","P847",null,{"$f":"$B$5","v":7},{"$f":"$B$7","v":2},{"$f":"$B$9","v":"B"},{"$f":"B11","v":"B"},{"$f":"$B$14","v":6},{"$f":"$B$16","v":"M"},{"$f":"$B$18","v":"0"},{"$f":"$B$20","v":"**"},{"$f":"$B$23","v":0},{"$f":"$B$25","v":"K"}]
["Vx auxiliary rating"]
[null,{"$f":"VLOOKUP(Database!$B$2,Database!$A$3:$C$5,3)","v":7}]
["In/Vn rating"]
[null,{"$f":"VLOOKUP(Database!$B$6,Database!$A$7:$C$8,3)","v":2}]
["Hardware options"]
[null,{"$f":"VLOOKUP(Database!$B$9,Database!$A$10:$C$20,3)","v":"B"}]
["Product options"]
[null,{"$f":"VLOOKUP(Database!$B$31,Database!$A$32:$C$34,3)","v":"B"}]
[{"$f":"VLOOKUP(Database!$B$31,Database!$A$32:$E$34,5,FALSE)","v":"Note: 50 Hz Only"}]
["Protocol options"]
[null,{"$f":"VLOOKUP(Database!$B$43,Database!$A$44:$C$48,3)","v":6}]
["Mounting"]
[null,{"$f":"VLOOKUP(Database!$B$50,Database!$A$51:$C$54,3)","v":"M"}]
["Language"]
[null,{"$f":"VLOOKUP(Database!$B$56,Database!$A$57:$C$59,3)","v":"0"}]
["Software version"]
[null,{"$f":"VLOOKUP(Database!$B$62,Database!$A$63:$C$65,3)","v":"**"}]
["Options available are derived from the latest version available with the specified hardware version ( i.e. using this date)",{"$f":"VLOOKUP(B20,Database!$A$91:$B$94,2)","v":"2010-09-24"}]
["Customer Specific Options"]
["Standard Version",{"$f":"VLOOKUP(Database!$B$67,Database!$A$68:$C$69,3)","v":0}]
["Hardware version"]
[null,{"$f":"VLOOKUP(Database!$B$73,Database!$A$74:$C$75,3)","v":"K"}]

{"sheet":"Documents","index":3,"n_rows":6,"n_cols":3,"rows_kept":6,"cut":false,"hidden":false,"merged":[]}
[{"$f":"CONCATENATE(Configurator!B3,Configurator!D3,Configurator!E3,Configurator!F3,Configurator!G3,Configurator!H3,Configurator!I3,Configurator!J3,Configurator!K3,Configurator!L3,Configurator!M3)","v":"P84772BB6M0**0K"}]
[]
["External Connection Diagram",":",{"$f":"VLOOKUP(Database!$B$31,Database!$A$32:$D$34,4)","v":"10P84702 Sheet 1"}]
["External Connection Diagram: Comms options",":","10Px4001-1"]
["Outline Diagram",":",{"$f":"HLOOKUP(Database!$B$31,Database!$F$20:$G$55,36)","v":"GN0086"}]
["Test Instruction",":","Z7Px40"]

{"sheet":"Master Text","index":4,"n_rows":43,"n_cols":3,"rows_kept":43,"cut":false,"hidden":false,"merged":[]}
[{"$f":"CONCATENATE(Configurator!B3,Configurator!D3,Configurator!E3,Configurator!F3,Configurator!G3,Configurator!H3,Configurator!I3,Configurator!J3,Configurator!K3,Configurator!L3,Configurator!M3)","v":"P84772BB6M0**0K"}]
["Version :"]
["P847 Phasor Measurement Unit"]
["Vx auxiliary rating :"]
[{"$f":"VLOOKUP(Database!$B$2,Database!$A$3:$C$5,2)","v":"24-54 Vdc"}]
["In/Vn rating :"]
[{"$f":"VLOOKUP(Database!$B$6,Database!$A$7:$C$8,2,FALSE)","v":"In = 1 A/5 A : Vn = 100 - 120 Vac, 12CT & 3VT (80TE)"}]
["Hardware options :"]
[{"$f":"VLOOKUP(Database!$B$9,Database!$A$10:$C$20,2)","v":"Ethernet (100Mbps) plus IRIG-B (De-modulated)"}]
["Product options : "]
[{"$f":"VLOOKUP(Database!$B$31,Database!$A$32:$B$41,2)","v":"16 Inputs & 8 Outputs (80TE) 50/60 Hz "}]
["Protocol options :"]
[{"$f":"VLOOKUP(Database!$B$43,Database!$A$44:$C$48,2)","v":"IEC61850 + Courier via rear RS485 port"}]
["Mounting :"]
[{"$f":"VLOOKUP(Database!$B$50,Database!$A$51:$B$54,2)","v":"Flush/Panel Mounting with Harsh Environment Coating"}]
["Language :"]
[{"$f":"VLOOKUP(Database!$B$56,Database!$A$57:$C$62,2)","v":"English, French, German, Spanish"}]
["Customer specific options ;"]
[{"$f":"VLOOKUP(Database!$B$67,Database!$A$68:$B$69,2)","v":"Standard Version"}]
["Software Version ;"]
[{"$f":"Configurator!K3","v":"**"}]
[]
[]
["Issue :"]
["Version :","A","Original - 08/08/08"]
[null,"B","CORTEC & Date Drivers amended, Protocol/Communications Option '8' was \"DNP3.0 over Ethernet\" only - 23/09/08"]
[null,"C","Models 'B' & 'C' & '70' Software released by CID BKIR-89PKDW - 12/10/2010"]
[null,"D","Minor BOM corrections 18/10/2010"]
[null,"E","Release of Harsh Environment coating option - see CID RPRI-8CYG5J - 19/02/2011"]
[null,"F","Note added for 50Hz applications - see CID LZOU-8FABKR - 30/03/2011"]
{"$rows_left_out":14}
{"sheet":"BOM","index":5,"n_rows":50,"n_cols":21,"rows_kept":50,"cut":false,"hidden":false,"merged":[[0,1,0,12]]}
["PCS MATERIAL MASTER","Requirements Key(s) / # of digit in model number",null,null,null,null,null,null,null,null,null,null,null,"Requirements Keys","Attribute Keys","NUMBER","DESCRIPTION","Ref","Qty. Required","Ref","Qty. Required"]
[{"$f":"'Master Text'!A1","v":"P84772BB6M0**0K"},4,5,6,7,8,9,10,"11","14",15]
[null,null,null,null,null,{"$f":"MID($A$2,8,1)","v":"B"},null,null,null,null,null,null,null,{"$f":"F3","v":"B"},"A","GN0524001","Final Assembly P847"," ",1,{"$f":"IF($N3=$O3,$R3,\"\")","v":""},{"$f":"IF(AND($N3<>\"\",$N3=$O3),$S3,\"\")","v":""}]
[null,null,null,null,null,"B",null,{"$f":"MID($A$2,10,1)","v":"M"},null,null,null,null,null,{"$f":"CONCATENATE(F4,H4)","v":"BM"},"BM","GN0535001","Final Assembly P847"," ",1," ",{"$f":"IF(AND($N4<>\"\",$N4=$O4),$S4,\"\")","v":1}]
[null,null,null,null,null,"B",null,{"$f":"MID($A$2,10,1)","v":"M"},null,null,null,null,null,{"$f":"CONCATENATE(F5,H5)","v":"BM"},"CM","GN0535001","Final Assembly P847"," ",1,"",{"$f":"IF(AND($N5<>\"\",$N5=$O5),$S5,\"\")","v":""}]
[null,null,null,null,null,"B",null,{"$f":"MID($A$2,10,1)","v":"M"},null,null,null,null,null,{"$f":"CONCATENATE(F6,H6)","v":"BM"},"BN","GN0535002","Final Assembly P847"," ",1,"",{"$f":"IF(AND($N6<>\"\",$N6=$O6),$S6,\"\")","v":""}]
[null,null,null,null,null,"B",null,{"$f":"MID($A$2,10,1)","v":"M"},null,null,null,null,null,{"$f":"CONCATENATE(F7,H7)","v":"BM"},"CN","GN0535002","Final Assembly P847"," ",1,"",{"$f":"IF(AND($N7<>\"\",$N7=$O7),$S7,\"\")","v":""}]
[null,null,null,null,null,"B",null,null,{"$f":"MID($A$2,11,1)","v":"0"},null,null,null,null,{"$f":"CONCATENATE(F8,I8)","v":"B0"},"A0","GN0277005","F/ASSY USER INTERFACE (60TE) ","Ref 9",1,"",{"$f":"IF($N8=$O8,$S8,\"\")","v":""}]
[null,null,null,null,null,{"$f":"MID($A$2,8,1)","v":"B"},null,null,"0",null,null,null,null,"B0","A5","GN0277005","F/ASSY USER INTERFACE (60TE) ","Ref 9",1,"",""]
[null,null,null,null,null,"B",null,null,"0",null,null,null,null,"B0","AC","GN0277006","F/ASSY CHINESE USER INTERFACE (60TE)","Ref 9",1,"",""]
[null,null,null,null,null,{"$f":"MID($A$2,8,1)","v":"B"},null,null,"0",null,null,null,null,"B0","B0","GN0341005","F/ASSY USER INTERFACE (80TE) ","Ref 11",1,"Ref 11",1]
[null,null,null,null,null,"B",null,null,"0",null,null,null,null,"B0","B5","GN0341005","F/ASSY USER INTERFACE (80TE) ","Ref 11",1,"",""]
[null,null,null,null,null,"B",null,null,"0",null,null,null,null,"B0","BC","GN0341006","F/ASSY CHINESE USER INTERFACE (80TE)","Ref 11",1,"",""]
[null,null,null,null,null,{"$f":"MID($A$2,8,1)","v":"B"},null,null,"0",null,null,null,null,"B0","C0","GN0341005","F/ASSY USER INTERFACE (80TE) ","Ref 11",1,"",""]
[null,null,null,null,null,"B",null,null,"0",null,null,null,null,"B0","C5","GN0341005","F/ASSY USER INTERFACE (80TE) ","Ref 11",1,"",""]
[null,null,null,null,null,"B",null,null,"0",null,null,null,null,"B0","CC","GN0341006","F/ASSY CHINESE USER INTERFACE (80TE)","Ref 11",1,"",""]
[null,null,{"$f":"MID($A$2,5,1)","v":"7"},null,null,null,null,null,null,null,null,null,null,{"$f":"C17","v":"7"},"1","ZN0021001","Power Supply","Ref 4",1,"",""]
[null,null,"7",null,null,null,null,null,null,null,null,null,null,"7","2","ZN0021002","Power Supply","Ref 4",1,"",""]
[null,null,"7",null,null,null,null,null,null,null,null,null,null,"7","3","ZN0021003","Power Supply","Ref 4",1,"",""]
[null,null,"7",null,null,null,null,null,null,null,null,null,null,"7","7","ZN0021201","Power Supply","Ref 4",1,"Ref 4",1]
[null,null,"7",null,null,null,null,null,null,null,null,null,null,"7","8","ZN0021202","Power Supply","Ref 4",1,"",""]
[null,null,"7",null,null,null,null,null,null,null,null,null,null,"7","9","ZN0021203","Power Supply","Ref 4",1,"",""]
[null,null,null,null,{"$f":"MID($A$2,7,1)","v":"B"},{"$f":"MID($A$2,8,1)","v":"B"},null,null,null,null,null,null,null,{"$f":"CONCATENATE(E23,F23)","v":"BB"},"BB","ZN0049003","PCB ASSY - Px40 100Mhz Ethernet bd- A/01","Ref 6",1,{"$f":"IF($N23=$O23,$R23,\"\")","v":"Ref 6"},{"$f":"IF($N23=$O23,$S23,\"\")","v":1}]
[null,null,null,null,"B","B",null,null,null,null,null,null,null,"BB","HB","ZN0071002","PCB  Red. Ethernet (SHR) non Mod IRIG-B","Ref 5",1,"",""]
[null,null,null,null,"B","B",null,null,null,null,null,null,null,"BB","KB","ZN0071006","PCB  Red. Ethernet (RSTP) Non Mod IRIG","Ref 5",1,"",""]
[null,null,null,null,"B","B",null,null,null,null,null,null,null,"BB","MB","ZN0071008","PCB  Red. Ethernet (DHS) Non Mod IRIG","Ref 5",1,"",""]
[null,null,null,null,"B","B",null,null,null,null,null,null,null,"BB","BC","ZN0049003","PCB ASSY - Px40 100Mhz Ethernet bd- A/01","Ref 6",1,"",""]
[null,null,null,null,"B","B",null,null,null,null,null,null,null,"BB","HC","ZN0071002","PCB  Red. Ethernet (SHR) non Mod IRIG-B","Ref 5",1,"",""]
[null,null,null,null,"B","B",null,null,null,null,null,null,null,"BB","KC","ZN0071006","PCB  Red. Ethernet (RSTP) Non Mod IRIG","Ref 5",1,"",""]
[null,null,null,null,"B","B",null,null,null,null,null,null,null,"BB","MC","ZN0071008","PCB  Red. Ethernet (DHS) Non Mod IRIG","Ref 5",1,"",""]
{"$rows_left_out":21}
{"sheet":"Database","index":6,"n_rows":94,"n_cols":9,"rows_kept":94,"cut":false,"hidden":true,"merged":[]}
[]
["Nominal Auxiliary Supply (Vx)",1,null,1,2,3,4,"A","Z"]
[1,"24-54 Vdc",7,null,{"$f":"HLOOKUP('Date Drivers'!$B$1,'Date Drivers'!$C$1:$X$40,26)","v":"IEC61850 + Courier via rear RS485 port"},{"$f":"HLOOKUP('Date Drivers'!$B$1,'Date Drivers'!$C$1:$X$40,26)","v":"IEC61850 + Courier via rear RS485 port"},{"$f":"HLOOKUP('Date Drivers'!$B$1,'Date Drivers'!$C$1:$X$40,26)","v":"IEC61850 + Courier via rear RS485 port"},{"$f":"HLOOKUP($A$90,'Date Drivers'!$C$1:$X$40,26)","v":"IEC61850 + Courier via rear RS485 port"},{"$f":"HLOOKUP($A$90,'Date Drivers'!$C$1:$X$40,26)","v":"IEC61850 + Courier via rear RS485 port"}]
[2,"48-125 Vdc (40-100 Vac)",8,null,{"$f":"HLOOKUP('Date Drivers'!$B$1,'Date Drivers'!$C$1:$X$40,27)","v":" "},{"$f":"HLOOKUP('Date Drivers'!$B$1,'Date Drivers'!$C$1:$X$40,27)","v":" "},{"$f":"HLOOKUP('Date Drivers'!$B$1,'Date Drivers'!$C$1:$X$40,27)","v":" "},{"$f":"HLOOKUP($A$90,'Date Drivers'!$C$1:$X$40,29)","v":"DNP3.0 Over Ethernet with Courier rear port K-Bus/RS485 protocol "},{"$f":"HLOOKUP($A$90,'Date Drivers'!$C$1:$X$40,29)","v":"DNP3.0 Over Ethernet with Courier rear port K-Bus/RS485 protocol "}]
[3,"110-250 Vdc (100-240 Vac)",9,null,{"$f":"HLOOKUP('Date Drivers'!$B$1,'Date Drivers'!$C$1:$X$40,28)","v":" "},{"$f":"HLOOKUP('Date Drivers'!$B$1,'Date Drivers'!$C$1:$X$40,28)","v":" "},{"$f":"HLOOKUP('Date Drivers'!$B$1,'Date Drivers'!$C$1:$X$40,28)","v":" "},{"$f":"HLOOKUP($A$90,'Date Drivers'!$C$1:$X$40,30)","v":" "},{"$f":"HLOOKUP($A$90,'Date Drivers'!$C$1:$X$40,30)","v":" "}]
["Current Rating (In) & Voltage Rating (Vn)",1,null,{"$f":"HLOOKUP('Date Drivers'!$B$1,'Date Drivers'!$C$1:$X$43,35)","v":6},{"$f":"HLOOKUP('Date Drivers'!$B$1,'Date Drivers'!$C$1:$X$43,35)","v":6},{"$f":"HLOOKUP('Date Drivers'!$B$1,'Date Drivers'!$C$1:$X$43,35)","v":6},{"$f":"HLOOKUP('Date Drivers'!$B$1,'Date Drivers'!$C$1:$X$43,35)","v":6},{"$f":"HLOOKUP($A$90,'Date Drivers'!$C$1:$X$40,35)","v":6},{"$f":"HLOOKUP($A$90,'Date Drivers'!$C$1:$X$40,35)","v":6}]
[1,{"$f":"HLOOKUP($B$31,$F$20:$H$70,37)","v":"In = 1 A/5 A : Vn = 100 - 120 Vac, 12CT & 3VT (80TE)"},{"$f":"HLOOKUP($B$31,$F$20:$H$70,39)","v":2},{"$f":"HLOOKUP('Date Drivers'!$B$1,'Date Drivers'!$C$1:$X$43,36)","v":8},{"$f":"HLOOKUP('Date Drivers'!$B$1,'Date Drivers'!$C$1:$X$43,36)","v":8},{"$f":"HLOOKUP('Date Drivers'!$B$1,'Date Drivers'!$C$1:$X$43,36)","v":8},{"$f":"HLOOKUP('Date Drivers'!$B$1,'Date Drivers'!$C$1:$X$43,36)","v":8},{"$f":"HLOOKUP($A$90,'Date Drivers'!$C$1:$X$40,38)","v":8},{"$f":"HLOOKUP($A$90,'Date Drivers'!$C$1:$X$40,38)","v":8}]
[2," ",1,{"$f":"HLOOKUP('Date Drivers'!$B$1,'Date Drivers'!$C$1:$X$43,37)","v":8},{"$f":"HLOOKUP('Date Drivers'!$B$1,'Date Drivers'!$C$1:$X$43,37)","v":8},{"$f":"HLOOKUP('Date Drivers'!$B$1,'Date Drivers'!$C$1:$X$43,37)","v":8},{"$f":"HLOOKUP('Date Drivers'!$B$1,'Date Drivers'!$C$1:$X$43,37)","v":8},{"$f":"HLOOKUP($A$90,'Date Drivers'!$C$1:$X$40,39)","v":8},{"$f":"HLOOKUP($A$90,'Date Drivers'!$C$1:$X$40,39)","v":8}]
["Hardware options",1]
[1,{"$f":"HLOOKUP($B$31,$F$20:$H$70,41)","v":"Ethernet (100Mbps) plus IRIG-B (De-modulated)"},{"$f":"HLOOKUP($B$31,$F$20:$H$70,48)","v":"B"}]
[2,{"$f":"HLOOKUP($B$31,$F$20:$H$70,42)","v":"Redundant Ethernet Self-Healing Ring + Un-modulated IRIG-B"},{"$f":"HLOOKUP($B$31,$F$20:$H$70,49)","v":"H"}]
[3,{"$f":"HLOOKUP($B$31,$F$20:$H$70,43)","v":"Redundant Ethernet Rapid Spanning Tree Protocol + Un-modulated IRIG-B"},{"$f":"HLOOKUP($B$31,$F$20:$H$70,50)","v":"K"}]
[4,{"$f":"HLOOKUP($B$31,$F$20:$H$70,44)","v":"Redundant Ethernet Dual Homing Star + Un-modulated IRIG-B"},{"$f":"HLOOKUP($B$31,$F$20:$H$70,51)","v":"M"}]
[5,{"$f":"HLOOKUP('Date Drivers'!$B$1,'Date Drivers'!$C$1:$G$133,123)","v":" "},{"$f":"HLOOKUP('Date Drivers'!$B$1,'Date Drivers'!$C$1:$G$148,138)","v":" "}]
[6,{"$f":"HLOOKUP('Date Drivers'!$B$1,'Date Drivers'!$C$1:$G$133,124)","v":" "},{"$f":"HLOOKUP('Date Drivers'!$B$1,'Date Drivers'!$C$1:$G$148,139)","v":" "}]
[7,{"$f":"HLOOKUP('Date Drivers'!$B$1,'Date Drivers'!$C$1:$G$133,125)","v":" "},{"$f":"HLOOKUP('Date Drivers'!$B$1,'Date Drivers'!$C$1:$G$148,140)","v":" "}]
[8,{"$f":"HLOOKUP('Date Drivers'!$B$1,'Date Drivers'!$C$1:$G$133,126)","v":" "},{"$f":"HLOOKUP('Date Drivers'!$B$1,'Date Drivers'!$C$1:$G$148,141)","v":" "}]
[9,{"$f":"HLOOKUP('Date Drivers'!$B$1,'Date Drivers'!$C$1:$G$133,127)","v":" "},{"$f":"HLOOKUP('Date Drivers'!$B$1,'Date Drivers'!$C$1:$G$148,142)","v":" "}]
[10,{"$f":"HLOOKUP('Date Drivers'!$B$1,'Date Drivers'!$C$1:$G$133,128)","v":" "},{"$f":"HLOOKUP('Date Drivers'!$B$1,'Date Drivers'!$C$1:$G$148,143)","v":" "}]
[11,{"$f":"HLOOKUP('Date Drivers'!$B$1,'Date Drivers'!$C$1:$G$133,129)","v":" "},{"$f":"HLOOKUP('Date Drivers'!$B$1,'Date Drivers'!$C$1:$G$148,143)","v":" "},null,null,1,2]
[null,null,null,null,null,{"$f":"HLOOKUP('Date Drivers'!$B$1,'Date Drivers'!$C$1:$G$118,48)","v":"8 Inputs & 8 Outputs + Backup Protection (60TE) 50/60 Hz - Withdrawn"},{"$f":"HLOOKUP('Date Drivers'!$B$1,'Date Drivers'!$C$1:$G$118,48)","v":"8 Inputs & 8 Outputs + Backup Protection (60TE) 50/60 Hz - Withdrawn"}]
[null,null,null,null,null,{"$f":"HLOOKUP('Date Drivers'!$B$1,'Date Drivers'!$C$1:$G$118,49)","v":"16 Inputs & 8 Outputs (80TE) 50/60 Hz "},{"$f":"HLOOKUP('Date Drivers'!$B$1,'Date Drivers'!$C$1:$G$118,49)","v":"16 Inputs & 8 Outputs (80TE) 50/60 Hz "}]
["Product options - 1",1,null,null,null,{"$f":"HLOOKUP('Date Drivers'!$B$1,'Date Drivers'!$C$1:$G$118,50)","v":"24 Inputs & 24 Outputs (80TE) 50/60 Hz"},{"$f":"HLOOKUP('Date Drivers'!$B$1,'Date Drivers'!$C$1:$G$118,50)","v":"24 Inputs & 24 Outputs (80TE) 50/60 Hz"}]
[1,{"$f":"HLOOKUP('Date Drivers'!$B$1,'Date Drivers'!$C$1:$G$47,44)","v":" "},{"$f":"HLOOKUP('Date Drivers'!$B$1,'Date Drivers'!$C$1:$G$47,46)","v":" "},null,null," "," "]
[2,{"$f":"HLOOKUP('Date Drivers'!$B$1,'Date Drivers'!$C$1:$G$47,45)","v":" "},{"$f":"HLOOKUP('Date Drivers'!$B$1,'Date Drivers'!$C$1:$G$47,47)","v":" "},null,null," "," "]
[3," ",null,null,null,{"$f":"HLOOKUP('Date Drivers'!$B$1,'Date Drivers'!$C$1:$G$118,53)","v":" "}," "]
[4,null,null,null,null,{"$f":"HLOOKUP('Date Drivers'!$B$1,'Date Drivers'!$C$1:$G$118,54)","v":" "},{"$f":"HLOOKUP('Date Drivers'!$B$1,'Date Drivers'!$C$1:$G$118,78)","v":" "}]
[null,null,null,null,null,{"$f":"HLOOKUP('Date Drivers'!$B$1,'Date Drivers'!$C$1:$G$118,55)","v":" "},{"$f":"HLOOKUP('Date Drivers'!$B$1,'Date Drivers'!$C$1:$G$118,79)","v":" "}]
[null,null,null,null,null,{"$f":"HLOOKUP('Date Drivers'!$B$1,'Date Drivers'!$C$1:$G$118,56)","v":" "},{"$f":"HLOOKUP('Date Drivers'!$B$1,'Date Drivers'!$C$1:$G$118,80)","v":" "}]
[null,null,null,null,null,{"$f":"HLOOKUP('Date Drivers'!$B$1,'Date Drivers'!$C$1:$G$118,57)","v":" "},{"$f":"HLOOKUP('Date Drivers'!$B$1,'Date Drivers'!$C$1:$G$118,81)","v":" "}]
{"$rows_left_out":65}
{"sheet":"Date Drivers","index":7,"n_rows":162,"n_cols":7,"rows_kept":162,"cut":false,"hidden":true,"merged":[]}
["Key Date",{"$f":"Configurator!B21","v":"2010-09-24"},"2008-08-08","2010-09-24","2011-08-16","2012-05-31",{"$f":"TODAY()","v":"2022-07-14"}]
["Software Version",null,"Standard","Standard","Standard","Standard","Standard"]
[null,null,"60","60","60","60","60"]
["Customer Specific Options",null,"Standard Version","Standard Version","Standard Version","Standard Version","Standard Version"]
[null,null,"0","0","0","0","0"]
["Hardware Version",null,"K","K","K","K","K"]
[]
["Language",null,"English, French, German, Spanish","English, French, German, Spanish","English, French, German, Spanish","English, French, German, Spanish","English, French, German, Spanish"]
[null,null,"English, French, German, Italian (Not yet available!)","English, French, German, Italian (Not yet available!)","English, French, German, Italian (Not yet available!)","English, French, German, Italian (Not yet available!)","English, French, German, Italian (Not yet available!)"]
[null,null,"English, French, German, Russian","English, French, German, Russian","English, French, German, Russian","English, French, German, Russian","English, French, German, Russian"]
[null,null,"Chinese, English or French via HMI, with English or French only via Communications port","Chinese, English or French via HMI","Chinese, English or French via HMI, (not yet available)","Chinese, English or French via HMI, (not yet available)","Chinese, English or French via HMI, (not yet available)"]
[null,null,"0","0","0","0","0"]
[null,null,"*","*","*","*","*"]
[null,null,"5","5","5","5","5"]
[null,null,"C","*","*","*","*"]
["Mounting / Livery Change",null,"Flush / Panel mounting ","Flush/Panel Mounting with Harsh Environment Coating","Flush/Panel Mounting with Harsh Environment Coating","Flush/Panel Mounting with Harsh Environment Coating","Flush/Panel Mounting with Harsh Environment Coating"]
[null,null," ","19\" Rack Mounting with Harsh Environmental Coating ","19\" Rack Mounting with Harsh Environmental Coating ","19\" Rack Mounting with Harsh Environmental Coating ","19\" Rack Mounting with Harsh Environmental Coating "]
[null,null," ","Flush/panel mounting with harsh environment coating","Flush/panel mounting with harsh environment coating","Flush/panel mounting with harsh environment coating","Flush/panel mounting with harsh environment coating"]
[null,null," ","19\" Rack mounting with harsh environmental coating (80TE only)","19\" Rack mounting with harsh environmental coating (80TE only)","19\" Rack mounting with harsh environmental coating (80TE only)","19\" Rack mounting with harsh environmental coating (80TE only)"]
[null,null,"M","M","M","M","M"]
[null,null," ","N","N","N","N"]
[null,null," ","P","P","P","P"]
[null,null," ","Q","Q","Q","Q"]
["Mounting (Master Text)",null,"Flush/Panel Mounting with Harsh Environment Coating","Flush/Panel Mounting with Harsh Environment Coating","Flush/Panel Mounting with Harsh Environment Coating","Flush/Panel Mounting with Harsh Environment Coating","Flush/Panel Mounting with Harsh Environment Coating"]
[null,null," "," "," "," "," "]
["Protocol options",null,"K-Bus","IEC61850 + Courier via rear RS485 port","IEC61850 + Courier via rear RS485 port","IEC61850 + Courier via rear RS485 port","IEC61850 + Courier via rear RS485 port"]
[null,null,"IEC870"," "]
[null,null,"DNP3.0"," "]
[null,null,"IEC61850 + Courier via rear RS485 port","DNP3.0 Over Ethernet with Courier rear port K-Bus/RS485 protocol "," "," "," "]
[null,null,"IEC61850+IEC60870-5-103 via rear RS485 port"," "," "," "," "]
{"$rows_left_out":132}